Target
Tyrosine-protein kinase JAK1
Ligand
BDBM305832
Substrate
Meas. Tech.
Caliper Enzyme Assay
IC50
>9857±n/a nM
Citation
 Brown, MFDermenci, AFensome, AGerstenberger, BSHayward, MMOwen, DRWright, SWXing, LHYang, X Pyrazolo[1,5-a]pyrazin-4-yl derivatives US Patent  US10822341 Publication Date 11/3/2020 
Target
Name:
Tyrosine-protein kinase JAK1
Synonyms:
JAK-1 JAK1A JAK1_HUMAN Janus kinase 1 (JAK1) | Janus kinase 1 JAK1
Type:
Protein
Mol. Mass.:
133293.73
Organism:
Homo sapiens (Human)
Description:
P23458
Residue:
1154
  
Inhibitor
Name:
BDBM305832
Synonyms:
2-((1r,3s)-1-(4-(6-(3-(Hydroxymethyl)-1-methyl-1H-pyrazol-4-yl)pyrazolo[1,5-a]pyrazin-4-yl)-1H-pyrazol-1-yl)-3-methoxycyclobutyl)acetonitrile US10822341, Example 31 | US11472809, Example 31
Type:
Small organic molecule
Emp. Form.:
C21H22N8O2
Mol. Mass.:
418.4518
SMILES:
CO[C@H]1C[C@@](CC#N)(C1)n1cc(cn1)-c1nc(cn2nccc12)-c1cn(C)nc1CO
: