Target
NADPH oxidase 1
Ligand
BDBM300377
Substrate
Meas. Tech.
ROS Production Measurement on hNOX1 Membranes
Ki
75.0±n/a nM
Citation
 Machin, PSharpe, ALock, CJChambers, MSHodges, AAllen, VEllard, JM Amido thiadiazole derivatives as NADPH oxidase inhibitors US Patent  US10130619 Publication Date 11/20/2018 
Target
Name:
NADPH oxidase 1
Synonyms:
MOX-1 Mitogenic oxidase 1 NOH-1 NOX-1 NOX1_HUMAN
Type:
PROTEIN
Mol. Mass.:
64890.44
Organism:
Homo sapiens (Human)
Description:
ChEMBL_792877
Residue:
564
  
Inhibitor
Name:
BDBM300377
Synonyms:
US10130619, Example 67
Type:
Small organic molecule
Emp. Form.:
C27H29N7O2S
Mol. Mass.:
515.63
SMILES:
C[C@H](Oc1ncc(cc1NC1CCN(C)CC1)C(=O)Nc1nnc(s1)-c1ccncc1)c1ccccc1
: