Target
Mitogen-activated protein kinase kinase kinase 14
Ligand
BDBM471701
Substrate
Meas. Tech.
AlphaScreen Assay
IC50
52.0±n/a nM
Citation
 Hynd, GTisselli, PMacLeod, CMann, SEPanchal, TAMontana, JGPrice, SC Pyrazolopyrimidine derivatives as NIK inhibitors US Patent  US10822342 Publication Date 11/3/2020 
Target
Name:
Mitogen-activated protein kinase kinase kinase 14
Synonyms:
HsNIK MAP3K14 NF-kappa-beta-inducing kinase (NF-kB) Serine/threonine-protein kinase NIK
Type:
Protein
Mol. Mass.:
104059.50
Organism:
Homo sapiens (Human)
Description:
Q99558
Residue:
947
  
Inhibitor
Name:
BDBM471701
Synonyms:
US10822342, Compound 9
Type:
Small organic molecule
Emp. Form.:
C25H29N7O2
Mol. Mass.:
459.5435
SMILES:
CCn1cc2nc(N)nc(-c3cn(CCCOC)c4cnc(cc34)C#CC(C)(O)C3CC3)c2n1
: