Target
Potassium voltage-gated channel subfamily A member 3
Ligand
BDBM412884
Substrate
Meas. Tech.
Patch-Clamp Assay
IC50
<500±n/a nM
Citation
 Tasler, SKrimmelbein, IKraus, JZaja, M KV1.3 inhibitors and their medical application US Patent  US10822345 Publication Date 11/3/2020 
Target
Name:
Potassium voltage-gated channel subfamily A member 3
Synonyms:
HGK5 HPCN3 KCNA3 Potassium voltage-gated channel subfamily A member 3 Voltage-gated potassium channel subunit Kv1.3
Type:
PROTEIN
Mol. Mass.:
63835.47
Organism:
Homo sapiens (Human)
Description:
ChEMBL_1513935
Residue:
575
  
Inhibitor
Name:
BDBM412884
Synonyms:
US10399991, Example 1 | US10822345, Ex 1
Type:
Small organic molecule
Emp. Form.:
C20H16O4
Mol. Mass.:
320.3386
SMILES:
COc1ccccc1-c1cc(=O)oc2c(C)c3occ(C)c3cc12
: