Target
Tyrosine-protein kinase BTK [386-659]
Ligand
BDBM467719
Substrate
Meas. Tech.
Kinase Lanthascreen Binding Assay
IC50
10.0±n/a nM
Citation
 Arora, NBacani, GMBarbay, JKBembenek, SDCai, MChen, WDeckhut, CPEdwards, JPGhosh, BHao, BKreutter, KDLi, GTichenor, MSVenable, JDWei, JWiener, JJWu, YZhu, YZhang, FZhang, ZXiao, K Inhibitors of Bruton's tyrosine kinase and methods of their use US Patent  US10822348 Publication Date 11/3/2020 
Target
Name:
Tyrosine-protein kinase BTK [386-659]
Synonyms:
AGMX1 BPK BTK_HUMAN | Tyrosine-protein kinase BTK (386-659)
Type:
Enzyme Catalytic Domain
Mol. Mass.:
31815.18
Organism:
Homo sapiens (Human)
Description:
aa 386-659
Residue:
274
  
Inhibitor
Name:
BDBM467719
Synonyms:
(R,E)-5-(2-Methyl-4-phenoxyphenyl)-N-(1-(4-(methylamino)but-2- enoyl)pyrrolidin-3-yl)-4-oxo-4,5-dihydro-3H-1-thia-3,5,8- triazaacenaphthylene-2-carboxamide; US10822348, Example 492
Type:
Small organic molecule
Emp. Form.:
C31H30N6O4S
Mol. Mass.:
582.673
SMILES:
CNC\C=C\C(=O)N1CC[C@H](C1)NC(=O)c1sc2nccc3n(-c4ccc(Oc5ccccc5)cc4C)c(=O)[nH]c1c23
: