Target
Tyrosine-protein kinase BTK [386-659]
Ligand
BDBM467452
Substrate
Meas. Tech.
Kinase Lanthascreen Binding Assay
IC50
10.0±n/a nM
Citation
 Arora, NBacani, GMBarbay, JKBembenek, SDCai, MChen, WDeckhut, CPEdwards, JPGhosh, BHao, BKreutter, KDLi, GTichenor, MSVenable, JDWei, JWiener, JJWu, YZhu, YZhang, FZhang, ZXiao, K Inhibitors of Bruton's tyrosine kinase and methods of their use US Patent  US10822348 Publication Date 11/3/2020 
Target
Name:
Tyrosine-protein kinase BTK [386-659]
Synonyms:
AGMX1 BPK BTK_HUMAN | Tyrosine-protein kinase BTK (386-659)
Type:
Enzyme Catalytic Domain
Mol. Mass.:
31815.18
Organism:
Homo sapiens (Human)
Description:
aa 386-659
Residue:
274
  
Inhibitor
Name:
BDBM467452
Synonyms:
(R)-5-(2-Methyl-4-phenoxyphenyl)-N-(1-(3- (methylsulfonyl)propanoyl)pyrrolidin-3-yl)-4-oxo-4,5-dihydro-3H-1- thia-3,5,8-triazaacenaphthylene-2-carboxamide; US10822348, Example 104
Type:
Small organic molecule
Emp. Form.:
C30H29N5O6S2
Mol. Mass.:
619.711
SMILES:
Cc1cc(Oc2ccccc2)ccc1-n1c2ccnc3sc(C(=O)N[C@@H]4CCN(C4)C(=O)CCS(C)(=O)=O)c([nH]c1=O)c23
: