Target
Tyrosine-protein kinase BTK [386-659]
Ligand
BDBM467359
Substrate
Meas. Tech.
Kinase Lanthascreen Binding Assay
IC50
6.31±n/a nM
Citation
 Arora, NBacani, GMBarbay, JKBembenek, SDCai, MChen, WDeckhut, CPEdwards, JPGhosh, BHao, BKreutter, KDLi, GTichenor, MSVenable, JDWei, JWiener, JJWu, YZhu, YZhang, FZhang, ZXiao, K Inhibitors of Bruton's tyrosine kinase and methods of their use US Patent  US10822348 Publication Date 11/3/2020 
Target
Name:
Tyrosine-protein kinase BTK [386-659]
Synonyms:
AGMX1 BPK BTK_HUMAN | Tyrosine-protein kinase BTK (386-659)
Type:
Enzyme Catalytic Domain
Mol. Mass.:
31815.18
Organism:
Homo sapiens (Human)
Description:
aa 386-659
Residue:
274
  
Inhibitor
Name:
BDBM467359
Synonyms:
(R)-N-(1-Acryloylpiperidin-3-yl)-5-(2-fluoro-4-phenoxyphenyl)-4- oxo-4,5-dihydro-3H-1-thia-3,5,8-triazaacenaphthylene-2- carboxamide; US10822348, Example 690
Type:
Small organic molecule
Emp. Form.:
C29H26N6O4S
Mol. Mass.:
554.62
SMILES:
Cc1nc(Oc2ccccc2)ccc1-n1c2ccnc3sc(C(=O)N[C@@H]4CCCN(C4)C(=O)C=C)c([nH]c1=O)c23
: