Target
Tyrosine-protein kinase BTK [386-659]
Ligand
BDBM468111
Substrate
Meas. Tech.
Kinase Lanthascreen Binding Assay
IC50
7.94±n/a nM
Citation
 Arora, NBacani, GMBarbay, JKBembenek, SDCai, MChen, WDeckhut, CPEdwards, JPGhosh, BHao, BKreutter, KDLi, GTichenor, MSVenable, JDWei, JWiener, JJWu, YZhu, YZhang, FZhang, ZXiao, K Inhibitors of Bruton's tyrosine kinase and methods of their use US Patent  US10822348 Publication Date 11/3/2020 
Target
Name:
Tyrosine-protein kinase BTK [386-659]
Synonyms:
AGMX1 BPK BTK_HUMAN | Tyrosine-protein kinase BTK (386-659)
Type:
Enzyme Catalytic Domain
Mol. Mass.:
31815.18
Organism:
Homo sapiens (Human)
Description:
aa 386-659
Residue:
274
  
Inhibitor
Name:
BDBM468111
Synonyms:
(R)-N-(1-Acryloylpyrrolidin-3-yl)-5-(*S)-(6-(cyclopentyloxy)-4- methylpyridin-3-yl)-4-oxo-4,5-dihydro-3H-1-thia-3,5,8- triazaacenaphthylene-2-carboxamide; US10822348, Example 776
Type:
Small organic molecule
Emp. Form.:
C27H28N6O4S
Mol. Mass.:
532.614
SMILES:
Cc1cc(OC2CCCC2)ncc1-n1c2ccnc3sc(C(=O)N[C@@H]4CCN(C4)C(=O)C=C)c([nH]c1=O)c23
: