Target
Serine/threonine-protein kinase pim-3
Ligand
BDBM377174
Substrate
Meas. Tech.
Pim Enzyme Assay
IC50
<100±n/a nM
Citation
 Xue, CLi, YFeng, HZhang, K Thiazolecarboxamides and pyridinecarboxamide compounds useful as pim kinase inhibitors US Patent  US10828290 Publication Date 11/10/2020 
Target
Name:
Serine/threonine-protein kinase pim-3
Synonyms:
PIM3 Serine/threonine-protein kinase pim-3 (PIM3)
Type:
Protein
Mol. Mass.:
35888.19
Organism:
Homo sapiens (Human)
Description:
Q86V86
Residue:
326
  
Inhibitor
Name:
BDBM377174
Synonyms:
5-Amino-N-{4-[3,4-trans-3-amino-4-hydroxypiperidin-1-yl]-6,7-dihydro-5H-cyclopenta[b]pyridin-3-yl}-2-(2,6-difluorophenyl)-1,3-thiazole-4-carboxamide (Enantiomer 2) US10517858, Example 25 US11229631, Example 25
Type:
Small organic molecule
Emp. Form.:
C23H24F2N6O2S
Mol. Mass.:
486.537
SMILES:
N[C@@H]1CN(CC[C@H]1O)c1c2CCCc2ncc1NC(=O)c1nc(sc1N)-c1c(F)cccc1F
: