Target
Serine/threonine-protein kinase pim-1
Ligand
BDBM424958
Substrate
Meas. Tech.
Pim Enzyme Assay
IC50
<100±n/a nM
Citation
 Xue, CLi, YFeng, HZhang, K Thiazolecarboxamides and pyridinecarboxamide compounds useful as pim kinase inhibitors US Patent  US10828290 Publication Date 11/10/2020 
Target
Name:
Serine/threonine-protein kinase pim-1
Synonyms:
PIM-1 Kinase PIM1_HUMAN Serine/threonine-protein kinase (PIM1) Serine/threonine-protein kinase PIM1 | Serine/threonine-protein kinase pim-1 (PIM1)
Type:
Protein
Mol. Mass.:
35681.82
Organism:
Homo sapiens (Human)
Description:
P11309
Residue:
313
  
Inhibitor
Name:
BDBM424958
Synonyms:
N-{4-[(3R,4R,5S)-3-Amino-4-hydroxy-5-methylpiperidin-1-yl]-7-hydroxy-6,7-dihydro-5H-cyclopenta[b]pyridin-3-yl}-6-(2,6-difluorophenyl)-5-fluoropyridine-2-carboxamide US10828290, Example 37 | US11229631, Example 37
Type:
Small organic molecule
Emp. Form.:
C26H26F3N5O3
Mol. Mass.:
513.5115
SMILES:
C[C@H]1CN(C[C@@H](N)[C@@H]1O)c1c2CCC(O)c2ncc1NC(=O)c1ccc(F)c(n1)-c1c(F)cccc1F
: