Target
Serine/threonine-protein kinase pim-3
Ligand
BDBM377195
Substrate
Meas. Tech.
Pim Enzyme Assay
IC50
<100±n/a nM
Citation
 Xue, CLi, YFeng, HZhang, K Thiazolecarboxamides and pyridinecarboxamide compounds useful as pim kinase inhibitors US Patent  US10828290 Publication Date 11/10/2020 
Target
Name:
Serine/threonine-protein kinase pim-3
Synonyms:
PIM3 Serine/threonine-protein kinase pim-3 (PIM3)
Type:
Protein
Mol. Mass.:
35888.19
Organism:
Homo sapiens (Human)
Description:
Q86V86
Residue:
326
  
Inhibitor
Name:
BDBM377195
Synonyms:
5-Amino-N-{4-[(3S,5R)-3-amino-5-(trifluoromethyl)piperidin-1-yl]-7-hydroxy-6,7-dihydro-5H-cyclopenta[b]pyridin-3-yl}-2-(2,6-difluorophenyl)-1,3-thiazole-4-carboxamide US10517858, Example 44 (Diastereoisomer 1) US11229631, Example 44 Diastereoisomer 1
Type:
Small organic molecule
Emp. Form.:
C24H23F5N6O2S
Mol. Mass.:
554.535
SMILES:
N[C@H]1C[C@H](CN(C1)c1c2CC[C@H](O)c2ncc1NC(=O)c1nc(sc1N)-c1c(F)cccc1F)C(F)(F)F
: