Target
Tyrosine-protein kinase BTK
Ligand
BDBM397310
Substrate
Meas. Tech.
Omnia Assay Protocol for Potency Assessment Against BTK
IC50
<10±n/a nM
Citation
 Singh, JPetter, RCTester, RWKluge, AFMazdiyasni, HWestlin, III, WFNiu, DQiao, L Substituted 2,4-diaminopyrimidines as kinase inhibitors US Patent  US10828300 Publication Date 11/10/2020 
Target
Name:
Tyrosine-protein kinase BTK
Synonyms:
AGMX1 Agammaglobulinaemia tyrosine kinase B cell progenitor kinase BPK BTK_HUMAN Tyrosine Kinase BTK Tyrosine-protein kinase BTK (BTK)
Type:
Enzyme
Mol. Mass.:
76289.95
Organism:
Homo sapiens (Human)
Description:
Q06187
Residue:
659
  
Inhibitor
Name:
BDBM397310
Synonyms:
US10596172, Compound I-99 US11351168, Compound I-99 | US9987276, Compound I-99
Type:
Small organic molecule
Emp. Form.:
C25H27FN6O2
Mol. Mass.:
462.5193
SMILES:
Cc1cccc(Nc2nc(Nc3cccc(NC(=O)\C=C\CN4CC[C@H](O)C4)c3)ncc2F)c1
: