Target
Histone acetyltransferase KAT6A [507-778]
Ligand
BDBM50527324
Substrate
Meas. Tech.
Biochemical Assay
IC50
2592±n/a nM
Citation
 Voss, AKBaell, JNguyen, HNLeaver, DJCleary, BLLagiakos, HRSheikh, BNThomas, TJ Aryl sulfonohydrazides US Patent  US10829446 Publication Date 11/10/2020 
Target
Name:
Histone acetyltransferase KAT6A [507-778]
Synonyms:
2.3.1.48 KAT6A MOZ MYST-3 Monocytic leukemia zinc finger protein Runt-related transcription factor-binding protein 2 Zinc finger protein 220
Type:
PROTEIN
Mol. Mass.:
224994.11
Organism:
Homo sapiens
Description:
Q92794[507-778]
Residue:
2004
  
Inhibitor
Name:
BDBM50527324
Synonyms:
CHEMBL4455968 | US10829446, Compound 110
Type:
Small organic molecule
Emp. Form.:
C18H14FN3O3S
Mol. Mass.:
371.385
SMILES:
Fc1ccccc1S(=O)(=O)NNC(=O)c1cncc(c1)-c1ccccc1
: