Target
Histone acetyltransferase KAT6A [507-778]
Ligand
BDBM50527337
Substrate
Meas. Tech.
Biochemical Assay
IC50
120±n/a nM
Citation
 Voss, AKBaell, JNguyen, HNLeaver, DJCleary, BLLagiakos, HRSheikh, BNThomas, TJ Aryl sulfonohydrazides US Patent  US10829446 Publication Date 11/10/2020 
Target
Name:
Histone acetyltransferase KAT6A [507-778]
Synonyms:
2.3.1.48 KAT6A MOZ MYST-3 Monocytic leukemia zinc finger protein Runt-related transcription factor-binding protein 2 Zinc finger protein 220
Type:
PROTEIN
Mol. Mass.:
224994.11
Organism:
Homo sapiens
Description:
Q92794[507-778]
Residue:
2004
  
Inhibitor
Name:
BDBM50527337
Synonyms:
CHEMBL4525271 | US10829446, Compound 130
Type:
Small organic molecule
Emp. Form.:
C16H17FN2O3S
Mol. Mass.:
336.381
SMILES:
CCCc1cccc(c1)C(=O)NNS(=O)(=O)c1ccccc1F
: