Target
Histone acetyltransferase KAT6A [507-778]
Ligand
BDBM50527298
Substrate
Meas. Tech.
Biochemical Assay
IC50
8.00±n/a nM
Citation
 Voss, AKBaell, JNguyen, HNLeaver, DJCleary, BLLagiakos, HRSheikh, BNThomas, TJ Aryl sulfonohydrazides US Patent  US10829446 Publication Date 11/10/2020 
Target
Name:
Histone acetyltransferase KAT6A [507-778]
Synonyms:
2.3.1.48 KAT6A MOZ MYST-3 Monocytic leukemia zinc finger protein Runt-related transcription factor-binding protein 2 Zinc finger protein 220
Type:
PROTEIN
Mol. Mass.:
224994.11
Organism:
Homo sapiens
Description:
Q92794[507-778]
Residue:
2004
  
Inhibitor
Name:
BDBM50527298
Synonyms:
CHEMBL4571483 | US10829446, Compound 152
Type:
Small organic molecule
Emp. Form.:
C18H15FN2O4S
Mol. Mass.:
374.386
SMILES:
Cc1cc(cc(C(=O)NNS(=O)(=O)c2ccccc2)c1F)-c1ccco1
: