Target
Mu-type opioid receptor
Ligand
BDBM472059
Substrate
Meas. Tech.
Receptor Binding Assay
Ki
3.40±n/a nM
Citation
 Kuehnert, SKoenigs, RMKless, AWegert, ARatcliffe, PJostock, RKoch, TLinz, KSchroeder, WSchiene, KKonetzki, I 3-((hetero-)aryl)-alkyl-8-amino-2-oxo-l,3-diaza-spiro-[4.5]-decane derivatives US Patent  US10829480 Publication Date 11/10/2020 
Target
Name:
Mu-type opioid receptor
Synonyms:
M-OR-1 MOR-1 MUOR1 Mu opiate receptor OPRM1 hMOP | mu-type opioid receptor isoform MOR-1
Type:
G Protein-Coupled Receptor (GPCR)
Mol. Mass.:
44789.51
Organism:
Homo sapiens (Human)
Description:
P35372
Residue:
400
  
Inhibitor
Name:
BDBM472059
Synonyms:
CIS-1-[[8-Dimethylamino-3-[(4-methoxyphenyl)-methyl]-2-oxo-8-phenyl-1,3- diazaspiro[4.5]decan-l-yl]-methyl-cyclobutane-1-carbonitrile | US10829480, Example SC_2074
Type:
Small organic molecule
Emp. Form.:
C30H38N4O2
Mol. Mass.:
486.6483
SMILES:
COc1ccc(CN2C[C@]3(CC[C@@](CC3)(N(C)C)c3ccccc3)N(CC3(CCC3)C#N)C2=O)cc1
: