Target
Solute carrier family 22 member 12
Ligand
BDBM472413
Substrate
Meas. Tech.
In Vitro Inhibitory Activity Assay
IC50
>5000±n/a nM
Citation
 Wang, JZhang, YZhu, WChen, S Thiophene, manufacturing method thereof, and pharmaceutical application of same US Patent  US10829483 Publication Date 11/10/2020 
Target
Name:
Solute carrier family 22 member 12
Synonyms:
OATL4 RST S22AC_HUMAN Solute carrier family 22 member 12 URAT1 Urate anion exchanger 1 (URAT1) | Uric Acid Transporter 1 (URAT1)
Type:
Enzyme
Mol. Mass.:
59638.65
Organism:
Homo sapiens (Human)
Description:
Q96S37
Residue:
553
  
Inhibitor
Name:
BDBM472413
Synonyms:
US10829483, Compound WX020
Type:
Small organic molecule
Emp. Form.:
C18H16FN3O2S2
Mol. Mass.:
389.467
SMILES:
OC(=O)CSc1nncn1-c1sc(c2CCCCc12)-c1cccc(F)c1
: