Target
[Pyruvate dehydrogenase (acetyl-transferring)] kinase isozyme 2, mitochondrial
Ligand
BDBM426381
Substrate
Meas. Tech.
Isothermal Titration Calorimetry
Kd
<300±n/a nM
Citation
 Buchstaller, H Bicyclic heterocyclic derivatives US Patent  US10829489 Publication Date 11/10/2020 
Target
Name:
[Pyruvate dehydrogenase (acetyl-transferring)] kinase isozyme 2, mitochondrial
Synonyms:
PDHK2 PDK2_HUMAN Pyruvate dehydrogenase kinase isoenzyme 1 (PDK2)
Type:
Enzyme
Mol. Mass.:
46153.78
Organism:
Homo sapiens (Human)
Description:
Q15119
Residue:
407
  
Inhibitor
Name:
BDBM426381
Synonyms:
US10526325, Compound A57 | US10829489, Compound A57
Type:
Small organic molecule
Emp. Form.:
C16H15F5N4O2
Mol. Mass.:
390.3079
SMILES:
C[C@@H]1CN(Cc2cnc(-c3ncc(F)cc3F)n12)C(=O)[C@@](C)(O)C(F)(F)F
: