Target
Cyclin-dependent kinase 4/G1/S-specific cyclin-D1
Ligand
BDBM472677
Substrate
Meas. Tech.
Inhibition In Vitro Assay
IC50
47700±n/a nM
Citation
 Strum, JCJung, D Substituted dihydropyrazino[1 ′,2′:1,5]pyrrolo[2,3-d]pyrimidine-based antiproliferative agents US Patent  US10829490 Publication Date 11/10/2020 
Target
Name:
Cyclin-dependent kinase 4/G1/S-specific cyclin-D1
Synonyms:
CDK4/CycD CDK4/Cyclin D1 Cyclin-Dependent Kinase 4 (CDK4) Cyclin-dependent kinase 4/G1/S-specific cyclin D1 | Cyclin-dependent kinase 4/cyclin D1
Type:
Protein Complex
Mol. Mass.:
Description:
CDK4/D1 complexes were purified from insect cells co-infected with baculovirus vectors containing each of the components.
Components:
This complex has 2 components.
Component 1
Name:
Cyclin-dependent kinase 4
Synonyms:
CDK4 Cell division protein kinase 4 PSK-J3
Type:
Enzyme Subunit
Mol. Mass.:
33731.96
Organism:
Homo sapiens (Human)
Description:
P11802
Residue:
303
  
Component 2
Name:
G1/S-specific cyclin-D1
Synonyms:
B-cell lymphoma 1 protein BCL-1 oncogene CCND1 PRAD1 | PRAD1 oncogene
Type:
Enzyme Subunit
Mol. Mass.:
33717.70
Organism:
Homo sapiens (Human)
Description:
Residue:
295
  
Inhibitor
Name:
BDBM472677
Synonyms:
2'-((5-(4-methylpiperazin-1- yl)pyridin-2-yl)amino)-6',6a',8',9'- tetrahydrospiro[cyclohexane-1,10'- pyrazino[1',2':1,6]pyrido[2,3- d]pyrimidin]-7'(5'H)-one | US10829490, Cmpd # 4
Type:
Small organic molecule
Emp. Form.:
C25H34N8O
Mol. Mass.:
462.5905
SMILES:
CN1CCN(CC1)c1ccc(Nc2ncc3CCC4N(c3n2)C2(CCCCC2)CNC4=O)nc1
: