Target
Cyclin-dependent kinase 2/G1/S-specific cyclin-E1
Ligand
BDBM472681
Substrate
Meas. Tech.
Inhibition In Vitro Assay
IC50
>100000±n/a nM
Citation
 Strum, JCJung, D Substituted dihydropyrazino[1 ′,2′:1,5]pyrrolo[2,3-d]pyrimidine-based antiproliferative agents US Patent  US10829490 Publication Date 11/10/2020 
Target
Name:
Cyclin-dependent kinase 2/G1/S-specific cyclin-E1
Synonyms:
CDK2/CycE CDK2/E Cyclin-Dependent Kinase 2 (CDK2) Cyclin-dependent kinase 2/cyclin E1
Type:
Protein
Mol. Mass.:
Description:
Components:
This complex has 2 components.
Component 1
Name:
Cyclin-dependent kinase 2
Synonyms:
CDK2 CDK2_HUMAN Cell division protein kinase 2 Protein cereblon/Cyclin-dependent kinase 2 | p33 protein kinase
Type:
Enzyme Subunit
Mol. Mass.:
33938.17
Organism:
Homo sapiens (Human)
Description:
P24941
Residue:
298
  
Component 2
Name:
G1/S-specific cyclin-E1
Synonyms:
CCNE CCNE1_HUMAN
Type:
Enzyme Subunit
Mol. Mass.:
47073.17
Organism:
Homo sapiens (Human)
Description:
Residue:
410
  
Inhibitor
Name:
BDBM472681
Synonyms:
2-((5-(4-methylpiperazin-1- yl)pyridin-2-yl)amino)- 6,6a,7,8,9,10-hexahydro-5H- pyrimido[5,4-c]quinolizin-5-one | US10829490, Cmpd # 7
Type:
Small organic molecule
Emp. Form.:
C21H27N7O
Mol. Mass.:
393.4854
SMILES:
CN1CCN(CC1)c1ccc(Nc2ncc3C(=O)CC4CCCCN4c3n2)nc1
: