Target
Cyclin-dependent kinase 6/G1/S-specific cyclin-D1 [L188C]
Ligand
BDBM472683
Substrate
Meas. Tech.
Inhibition In Vitro Assay
IC50
1800±n/a nM
Citation
 Strum, JCJung, D Substituted dihydropyrazino[1 ′,2′:1,5]pyrrolo[2,3-d]pyrimidine-based antiproliferative agents US Patent  US10829490 Publication Date 11/10/2020 
Target
Name:
Cyclin-dependent kinase 6/G1/S-specific cyclin-D1 [L188C]
Synonyms:
CDK6/Cyclin D | Cyclin-Dependent Kinase 6 (CDK6)
Type:
Protein Complex
Mol. Mass.:
Description:
Components:
This complex has 2 components.
Component 1
Name:
Cyclin-dependent kinase 6
Synonyms:
CDK6 CDKN6 Cyclin-dependent kinase 6 (CDK 6) | Serine/threonine-protein kinase PLSTIRE
Type:
Enzyme Subunit
Mol. Mass.:
36937.42
Organism:
Homo sapiens (Human)
Description:
Q00534
Residue:
326
  
Component 2
Name:
G1/S-specific cyclin-D1 [L188C]
Synonyms:
BCL1 CCND1_HUMAN PRAD1
Type:
Enzyme Subunit
Mol. Mass.:
33634.57
Organism:
Homo sapiens (Human)
Description:
P24385[L188C]
Residue:
295
  
Inhibitor
Name:
BDBM472683
Synonyms:
N-(5-(4-methylpiperazin-1- yl)pyridin-2-yl)-8',9'- dihydrospiro[cyclohexane-1,10'- pyrido[1,6-a:2,3-d']dipyrimidin]- 2'-amine | US10829490, Cmpd # 9
Type:
Small organic molecule
Emp. Form.:
C25H32N8
Mol. Mass.:
444.5752
SMILES:
CN1CCN(CC1)c1ccc(Nc2ncc3C=CC4=NCCC5(CCCCC5)N4c3n2)nc1
: