Target
Cyclin-T1/Cyclin-dependent kinase 9
Ligand
BDBM472683
Substrate
Meas. Tech.
Inhibition In Vitro Assay
IC50
>100000±n/a nM
Citation
 Strum, JCJung, D Substituted dihydropyrazino[1 ′,2′:1,5]pyrrolo[2,3-d]pyrimidine-based antiproliferative agents US Patent  US10829490 Publication Date 11/10/2020 
Target
Name:
Cyclin-T1/Cyclin-dependent kinase 9
Synonyms:
CDK9/ Cyclin-T1 CDK9/Cyclin T Cyclin T1/dependent kinase 9 | Cyclin-Dependent Kinase 9 (CDK9)
Type:
Protein Complex
Mol. Mass.:
Description:
Components:
This complex has 2 components.
Component 1
Name:
Cyclin-T1
Synonyms:
CCNT1 CycT Cyclin T Cyclin-T
Type:
Enzyme Subunit
Mol. Mass.:
80712.40
Organism:
Homo sapiens (Human)
Description:
Residue:
726
  
Component 2
Name:
Cyclin-dependent kinase 9
Synonyms:
C-2K CDK9 Cell division cycle 2-like protein kinase 4 Cyclin-Dependent Kinase 9 (CDK9) Serine/threonine-protein kinase PITALRE Tat-associated kinase complex catalytic subunit
Type:
Enzyme Subunit
Mol. Mass.:
42789.13
Organism:
Homo sapiens (Human)
Description:
Residue:
372
  
Inhibitor
Name:
BDBM472683
Synonyms:
N-(5-(4-methylpiperazin-1- yl)pyridin-2-yl)-8',9'- dihydrospiro[cyclohexane-1,10'- pyrido[1,6-a:2,3-d']dipyrimidin]- 2'-amine | US10829490, Cmpd # 9
Type:
Small organic molecule
Emp. Form.:
C25H32N8
Mol. Mass.:
444.5752
SMILES:
CN1CCN(CC1)c1ccc(Nc2ncc3C=CC4=NCCC5(CCCCC5)N4c3n2)nc1
: