Target
Tyrosine-protein kinase BTK
Ligand
BDBM472717
Substrate
Meas. Tech.
Inhibitory Activity Assay
IC50
<1.000±n/a nM
Citation
 Zhang, ADing, JXie, HSong, ZXue, YTong, LGeng, M Pyrimido[5,4-B]indolizine or pyrimido[5,4-B]pyrrolizine compound, preparation method and use thereof US Patent  US10829491 Publication Date 11/10/2020 
Target
Name:
Tyrosine-protein kinase BTK
Synonyms:
AGMX1 Agammaglobulinaemia tyrosine kinase B cell progenitor kinase BPK BTK_HUMAN Tyrosine Kinase BTK Tyrosine-protein kinase BTK (BTK)
Type:
Enzyme
Mol. Mass.:
76289.95
Organism:
Homo sapiens (Human)
Description:
Q06187
Residue:
659
  
Inhibitor
Name:
BDBM472717
Synonyms:
US10829491, Compound S11
Type:
Small organic molecule
Emp. Form.:
C25H22FN5O2
Mol. Mass.:
443.4729
SMILES:
Nc1ncnc2n3C[C@@H](CCc3c(-c3ccc(Oc4ccc(F)cc4)cc3)c12)NC(=O)C=C
: