Target
Platelet-derived growth factor receptor alpha [D842V]
Ligand
BDBM472795
Substrate
Meas. Tech.
Biochemical Enzymatic Activity
IC50
<0.30±n/a nM
Citation
 Dineen, TA Compositions and methods for treating KIT- and PDGFRA-mediated diseases US Patent  US10829493 Publication Date 11/10/2020 
Target
Name:
Platelet-derived growth factor receptor alpha [D842V]
Synonyms:
PDGFR2 PGFRA_HUMAN Platelet-derived growth factor receptor alpha (PDGFR)(D842V) RHEPDGFRA
Type:
Protein
Mol. Mass.:
122618.43
Organism:
Homo sapiens (Human)
Description:
P16234 (D842V)
Residue:
1089
  
Inhibitor
Name:
BDBM472795
Synonyms:
US10829493, Example 21
Type:
Small organic molecule
Emp. Form.:
C29H31FN10O
Mol. Mass.:
554.6212
SMILES:
C[C@](N)(c1ccc(F)cc1)c1cnc(nc1)N1CCN(CC1)c1ncnn2cc(cc12)-c1cnn(c1)[C@H]1CC[C@@H]1O
: