Target
Mast/stem cell growth factor receptor Kit
Ligand
BDBM472794
Substrate
Meas. Tech.
Biochemical Activity Assay
Kd
<10±n/a nM
Citation
 Dineen, TA Compositions and methods for treating KIT- and PDGFRA-mediated diseases US Patent  US10829493 Publication Date 11/10/2020 
Target
Name:
Mast/stem cell growth factor receptor Kit
Synonyms:
CD117 antigen KIT Mast/stem cell growth factor receptor Kit (cKIT) Proto-oncogene tyrosine-protein kinase Kit Stem cell growth factor receptor Tyrosine-protein kinase Kit c-kit v-kit Hardy-Zuckerman 4 feline sarcoma viral oncogene homolog
Type:
Protein
Mol. Mass.:
109869.37
Organism:
Homo sapiens (Human)
Description:
P10721
Residue:
976
  
Inhibitor
Name:
BDBM472794
Synonyms:
US10829493, Example 20
Type:
Small organic molecule
Emp. Form.:
C29H31FN10O2
Mol. Mass.:
570.6206
SMILES:
C[C@](N)(c1ccc(F)cc1)c1cnc(nc1)N1CCN(CC1)c1ncnn2cc(cc12)-c1cnn(c1)[C@H]1COC[C@H]1O
: