Target
Phosphatidylinositol 4,5-bisphosphate 3-kinase catalytic subunit delta isoform
Ligand
BDBM415499
Substrate
Meas. Tech.
Scintillation Proximity Assay
IC50
300±n/a nM
Citation
 Li, YMetcalf, BWCombs, AP Pyrimidinones as PI3K inhibitors US Patent  US10829502 Publication Date 11/10/2020 
Target
Name:
Phosphatidylinositol 4,5-bisphosphate 3-kinase catalytic subunit delta isoform
Synonyms:
PI3-kinase p110 subunit delta PI3-kinase subunit p110-delta PIK3CD Phosphatidylinositol 4,5-biphosphate 3-kinase catalytic subunit delta (PIK3CD) Phosphatidylinositol 4,5-bisphosphate 3-kinase 110 kDa catalytic subunit delta (PI3K delta) Phosphatidylinositol 4,5-bisphosphate 3-kinase catalytic subunit delta (PI3Kdelta) Phosphatidylinositol 4,5-bisphosphate 3-kinase catalytic subunit delta isoform (PI3K delta) Phosphatidylinositol 4,5-bisphosphate 3-kinase catalytic subunit delta isoform (PI3K-delta) Phosphatidylinositol 4,5-bisphosphate 3-kinase catalytic subunit delta isoform (PI3Kdelta)
Type:
Enzyme Subunit
Mol. Mass.:
119489.41
Organism:
Homo sapiens (Human)
Description:
O00329
Residue:
1044
  
Inhibitor
Name:
BDBM415499
Synonyms:
6-(2-chlorophenyl)-3-methyl-7-[1-(9H-purin-6-ylamino)ethyl]-5H-[1,3]thiazolo[3,2-a]pyrimidin-5-one trifluoroacetic acid salt US10829502, Example 43-1 | US11401280, Example 43-1
Type:
Small organic molecule
Emp. Form.:
C20H16ClN7OS
Mol. Mass.:
437.905
SMILES:
C[C@@H](Nc1ncnc2[nH]cnc12)c1nc2scc(C)n2c(=O)c1-c1ccccc1Cl
: