Target
Bromodomain-containing protein 4 [49-170]
Ligand
BDBM472838
Substrate
Meas. Tech.
In vitro Bromodomain Inhibition Assay
IC50
700±n/a nM
Citation
 Jacquemot, GClaridge, SBayrakdarian, MJohnstone, SAlbert, JSGriffin, A N-substituted bicyclic lactams, their preparation and their use as pharmaceuticals US Patent  US10836742 Publication Date 11/17/2020 
Target
Name:
Bromodomain-containing protein 4 [49-170]
Synonyms:
BRD4 BRD4-BD1 (aa 49-170) Bromodomain containing 4 (aa 49-170) Bromodomain-containing protein 4 (BRD4)(49-170) HUNK1
Type:
Enzyme Catalytic Domain
Mol. Mass.:
14593.14
Organism:
Homo sapiens (Human)
Description:
aa 49-170 (BRD4-BD1)
Residue:
122
  
Inhibitor
Name:
BDBM472838
Synonyms:
US10836742, Compound 9
Type:
Small organic molecule
Emp. Form.:
C23H21FN2O2
Mol. Mass.:
376.4234
SMILES:
Cc1cc(cn(C)c1=O)-c1ccc2CCC(=O)N(Cc3ccc(F)cc3)c2c1
: