Target
Lysine-specific histone demethylase 1A
Ligand
BDBM472878
Substrate
Meas. Tech.
LSD1 In Vitro Activity Assay
IC50
24.1±2.96 nM
Citation
 Liu, HLi, JWang, JSu, MWang, SZhou, YZhu, WXu, WLi, CJiang, HChen, K Fluorinated cyclopropylamine compound, preparation method therefor, pharmaceutical composition thereof, and uses thereof US Patent  US10836743 Publication Date 11/17/2020 
Target
Name:
Lysine-specific histone demethylase 1A
Synonyms:
AOF2 Flavin-containing amine oxidase domain-containing protein 2 KDM1A KIAA0601 Lysine-specific demethylase 1 (LSD1) Lysine-specific histone demethylase 1 (LSD1)
Type:
Enzyme
Mol. Mass.:
92901.01
Organism:
Homo sapiens (Human)
Description:
O60341
Residue:
852
  
Inhibitor
Name:
BDBM472878
Synonyms:
N-((4-fluoro-1-(3-phenylpropyl) piperidin-4-yl)methyl)-trans-2- phenylcyclopropylamine | US10836743, Compound A12
Type:
Small organic molecule
Emp. Form.:
C24H31FN2
Mol. Mass.:
366.5147
SMILES:
FC1(CNC2CC2c2ccccc2)CCN(CCCc2ccccc2)CC1
: