Target
Lysine-specific histone demethylase 1A
Ligand
BDBM472905
Substrate
Meas. Tech.
LSD1 In Vitro Activity Assay
IC50
78.9±21.14 nM
Citation
 Liu, HLi, JWang, JSu, MWang, SZhou, YZhu, WXu, WLi, CJiang, HChen, K Fluorinated cyclopropylamine compound, preparation method therefor, pharmaceutical composition thereof, and uses thereof US Patent  US10836743 Publication Date 11/17/2020 
Target
Name:
Lysine-specific histone demethylase 1A
Synonyms:
AOF2 Flavin-containing amine oxidase domain-containing protein 2 KDM1A KIAA0601 Lysine-specific demethylase 1 (LSD1) Lysine-specific histone demethylase 1 (LSD1)
Type:
Enzyme
Mol. Mass.:
92901.01
Organism:
Homo sapiens (Human)
Description:
O60341
Residue:
852
  
Inhibitor
Name:
BDBM472905
Synonyms:
Piperidin-4-ylmethyl 4-fluoro-4-(((2-(6-(3-(trifluoro- methyl)phenyl)pyridin-3-yl) cyclopropyl)amino)methyl) piperidine-1-carboxylate | US10836743, Compound A117
Type:
Small organic molecule
Emp. Form.:
C28H34F4N4O2
Mol. Mass.:
534.5888
SMILES:
FC(F)(F)c1cccc(c1)-c1ccc(cn1)C1CC1NCC1(F)CCN(CC1)C(=O)OCC1CCNCC1
: