Target
Amine oxidase [flavin-containing] B
Ligand
BDBM472860
Substrate
Meas. Tech.
MAOA and MAOB In Vitro Activity Experiments
IC50
12780±1350 nM
Citation
 Liu, HLi, JWang, JSu, MWang, SZhou, YZhu, WXu, WLi, CJiang, HChen, K Fluorinated cyclopropylamine compound, preparation method therefor, pharmaceutical composition thereof, and uses thereof US Patent  US10836743 Publication Date 11/17/2020 
Target
Name:
Amine oxidase [flavin-containing] B
Synonyms:
AOFB_HUMAN MAOB Monoamine oxidase type B (MAO B) Monoamine oxidase type B (MAOB)
Type:
Protein
Mol. Mass.:
58768.76
Organism:
Homo sapiens (Human)
Description:
P27338
Residue:
520
  
Inhibitor
Name:
BDBM472860
Synonyms:
Methyl 4-((4-fluoro-4-(((trans-2-phenylcyclo- propyl)amino)methyl)piperidin-1-yl) methyl)benzoate | US10836743, Compound A3
Type:
Small organic molecule
Emp. Form.:
C24H29FN2O2
Mol. Mass.:
396.4977
SMILES:
COC(=O)c1ccc(CN2CCC(F)(CNC3CC3c3ccccc3)CC2)cc1
: