Target
Amine oxidase [flavin-containing] B
Ligand
BDBM472868
Substrate
Meas. Tech.
MAOA and MAOB In Vitro Activity Experiments
IC50
>100000±n/a nM
Citation
 Liu, HLi, JWang, JSu, MWang, SZhou, YZhu, WXu, WLi, CJiang, HChen, K Fluorinated cyclopropylamine compound, preparation method therefor, pharmaceutical composition thereof, and uses thereof US Patent  US10836743 Publication Date 11/17/2020 
Target
Name:
Amine oxidase [flavin-containing] B
Synonyms:
AOFB_HUMAN MAOB Monoamine oxidase type B (MAO B) Monoamine oxidase type B (MAOB)
Type:
Protein
Mol. Mass.:
58768.76
Organism:
Homo sapiens (Human)
Description:
P27338
Residue:
520
  
Inhibitor
Name:
BDBM472868
Synonyms:
Methyl 3-(4-fluoro-4-(((trans-2-phenylcyclo- propyl)amino)methyl)piperidin-1- yl)-propionate | US10836743, Compound A7
Type:
Small organic molecule
Emp. Form.:
C19H27FN2O2
Mol. Mass.:
334.4283
SMILES:
COC(=O)CCN1CCC(F)(CNC2CC2c2ccccc2)CC1
: