Target
Amine oxidase [flavin-containing] B
Ligand
BDBM472870
Substrate
Meas. Tech.
MAOA and MAOB In Vitro Activity Experiments
IC50
>100000±n/a nM
Citation
 Liu, HLi, JWang, JSu, MWang, SZhou, YZhu, WXu, WLi, CJiang, HChen, K Fluorinated cyclopropylamine compound, preparation method therefor, pharmaceutical composition thereof, and uses thereof US Patent  US10836743 Publication Date 11/17/2020 
Target
Name:
Amine oxidase [flavin-containing] B
Synonyms:
AOFB_HUMAN MAOB Monoamine oxidase type B (MAO B) Monoamine oxidase type B (MAOB)
Type:
Protein
Mol. Mass.:
58768.76
Organism:
Homo sapiens (Human)
Description:
P27338
Residue:
520
  
Inhibitor
Name:
BDBM472870
Synonyms:
1-(4-fluoro-4-(((trans-2-phenylcyclo- propyl)amino)methyl)piperidin-1- yl)-3-phenyl-1-propanone | US10836743, Compound A8
Type:
Small organic molecule
Emp. Form.:
C24H29FN2O
Mol. Mass.:
380.4983
SMILES:
FC1(CNC2CC2c2ccccc2)CCN(CC1)C(=O)CCc1ccccc1
: