Target
Amine oxidase [flavin-containing] B
Ligand
BDBM472908
Substrate
Meas. Tech.
MAOA and MAOB In Vitro Activity Experiments
IC50
>100000±n/a nM
Citation
 Liu, HLi, JWang, JSu, MWang, SZhou, YZhu, WXu, WLi, CJiang, HChen, K Fluorinated cyclopropylamine compound, preparation method therefor, pharmaceutical composition thereof, and uses thereof US Patent  US10836743 Publication Date 11/17/2020 
Target
Name:
Amine oxidase [flavin-containing] B
Synonyms:
AOFB_HUMAN MAOB Monoamine oxidase type B (MAO B) Monoamine oxidase type B (MAOB)
Type:
Protein
Mol. Mass.:
58768.76
Organism:
Homo sapiens (Human)
Description:
P27338
Residue:
520
  
Inhibitor
Name:
BDBM472908
Synonyms:
Piperidin-4-ylmethyl 4-fluoro-4-((((1S,2R)-2-phenyl- cyclopropyl)amino)methyl) piperidine-1-carboxylate | US10836743, Compound (1S,2R)-A43
Type:
Small organic molecule
Emp. Form.:
C22H32FN3O2
Mol. Mass.:
389.5068
SMILES:
FC1(CN[C@H]2C[C@@H]2c2ccccc2)CCN(CC1)C(=O)OCC1CCNCC1
: