Target
5-hydroxytryptamine receptor 2C
Ligand
BDBM472997
Substrate
Meas. Tech.
Radioligand Binding Assay
Ki
13.8±n/a nM
Citation
 Semple, GRen, ASSchrader, TOKasem, MZhu, X 5-HT2C receptor agonists and compositions and methods of use US Patent  US10836764 Publication Date 11/17/2020 
Target
Name:
5-hydroxytryptamine receptor 2C
Synonyms:
5-HT-2C 5-HT2C-INI 5-HTR2C 5-hydroxytryptamine receptor 2C (5-HT-2C) 5HT-1C HTR1C Serotonin (5-HT3) receptor Serotonin Receptor 2C
Type:
G Protein-Coupled Receptor (GPCR)
Mol. Mass.:
51836.79
Organism:
Homo sapiens (Human)
Description:
P28335
Residue:
458
  
Inhibitor
Name:
BDBM472997
Synonyms:
(R)-4-(isopropoxymethyl)-6,6a,7,8,9,10- hexahydro-5H-pyrazino[1,2-a][1,8]naphthyridine | US10836764, Compound 145
Type:
Small organic molecule
Emp. Form.:
C15H23N3O
Mol. Mass.:
261.3626
SMILES:
CC(C)OCc1ccnc2N3CCNC[C@H]3CCc12
: