Target
5-hydroxytryptamine receptor 2A
Ligand
BDBM473003
Substrate
Meas. Tech.
Radioligand Binding Assay
Ki
1140±n/a nM
Citation
 Semple, GRen, ASSchrader, TOKasem, MZhu, X 5-HT2C receptor agonists and compositions and methods of use US Patent  US10836764 Publication Date 11/17/2020 
Target
Name:
5-hydroxytryptamine receptor 2A
Synonyms:
5-HT-2 5-HT2A 5-hydroxytryptamine receptor 2A (5HT-2A) 5HT2A_HUMAN HTR2A | Serotonin receptor 2A
Type:
undefined
Mol. Mass.:
52607.65
Organism:
Homo sapiens (Human)
Description:
P28223
Residue:
471
  
Inhibitor
Name:
BDBM473003
Synonyms:
(R)-4-(3,3,3-trifluoropropyl)-5,6,6a,7,8,9,10,11- octahydro-[1,4]diazepino[1,2-a][1,8]naphthyridine | US10836764, Compound 157
Type:
Small organic molecule
Emp. Form.:
C15H20F3N3
Mol. Mass.:
299.3346
SMILES:
FC(F)(F)CCc1ccnc2N3CCCNC[C@H]3CCc12
: