Target
Neuromedin-K receptor
Ligand
BDBM50112244
Substrate
Meas. Tech.
Competitive Binding Assays
Ki
23.0±n/a nM
Citation
 Hoveyda, HDutheuil, GFraser, G N-acyl-(3-substituted)-(8-substituted)-5,6-dihydro-[1,2,4]triazolo[4,3-a]pyrazines as selective NK-3 receptor antagonists US Patent  US10836768 Publication Date 11/17/2020 
Target
Name:
Neuromedin-K receptor
Synonyms:
NK-3 receptor NK3R NKR Neurokinin B receptor Neuromedin-3 receptor (NK-3R) Neuromedin-K receptor Neuromedin-K receptor (NK3) TAC3R Tachykinin receptor 3 | Tachykinin receptor 3 (NK3)
Type:
Enzyme
Mol. Mass.:
52221.96
Organism:
Homo sapiens (Human)
Description:
P29371
Residue:
465
  
Inhibitor
Name:
BDBM50112244
Synonyms:
CHEMBL3608680 US10836768, Cpd no 5 US9422299, 5 | US9987274, Compound 5
Type:
Small organic molecule
Emp. Form.:
C16H15FN6OS
Mol. Mass.:
358.393
SMILES:
C[C@H]1N(CCn2c1nnc2-c1nc(C)ns1)C(=O)c1ccc(F)cc1
: