Target
Capsid protein
Ligand
BDBM473030
Substrate
Meas. Tech.
HBV DNA Quantification Assay
EC50
4.10±n/a nM
Citation
 Gutierrez, DAKobayashi, TLazerwith, SELee, RAMorganelli, PAPyun, H Substituted pyrrolizine compounds and uses thereof US Patent  US10836769 Publication Date 11/17/2020 
Target
Name:
Capsid protein
Synonyms:
C Core antigen HBcAg | p21.5
Type:
Enzyme Catalytic Domain
Mol. Mass.:
21105.01
Organism:
Hepatitis B virus genotype C subtype ayr (isolate Human/Japan/Okamoto/-) (HBV-C)
Description:
Residue:
183
  
Inhibitor
Name:
BDBM473030
Synonyms:
US10836769, Example 17
Type:
Small organic molecule
Emp. Form.:
C23H21F3N6O3
Mol. Mass.:
486.4464
SMILES:
Cc1c(C(=O)Nc2ccc(F)cc2)c2CCCn2c1C(=O)C(=O)NC1(CC(F)(F)C1)c1cnn[nH]1
: