Target
Capsid protein
Ligand
BDBM473035
Substrate
Meas. Tech.
HBV DNA Quantification Assay
EC50
31.5±n/a nM
Citation
 Gutierrez, DAKobayashi, TLazerwith, SELee, RAMorganelli, PAPyun, H Substituted pyrrolizine compounds and uses thereof US Patent  US10836769 Publication Date 11/17/2020 
Target
Name:
Capsid protein
Synonyms:
C Core antigen HBcAg | p21.5
Type:
Enzyme Catalytic Domain
Mol. Mass.:
21105.01
Organism:
Hepatitis B virus genotype C subtype ayr (isolate Human/Japan/Okamoto/-) (HBV-C)
Description:
Residue:
183
  
Inhibitor
Name:
BDBM473035
Synonyms:
US10836769, Example 22
Type:
Small organic molecule
Emp. Form.:
C24H22F4N4O4
Mol. Mass.:
506.4495
SMILES:
CNC(=O)C1(CC(F)(F)C1)NC(=O)C(=O)c1c(C)c(C(=O)Nc2ccc(F)c(F)c2)c2[C@H]3C[C@H]3Cn12
: