Target
Capsid protein
Ligand
BDBM473069
Substrate
Meas. Tech.
HBV DNA Quantification Assay
EC50
3.00±n/a nM
Citation
 Gutierrez, DAKobayashi, TLazerwith, SELee, RAMorganelli, PAPyun, H Substituted pyrrolizine compounds and uses thereof US Patent  US10836769 Publication Date 11/17/2020 
Target
Name:
Capsid protein
Synonyms:
C Core antigen HBcAg | p21.5
Type:
Enzyme Catalytic Domain
Mol. Mass.:
21105.01
Organism:
Hepatitis B virus genotype C subtype ayr (isolate Human/Japan/Okamoto/-) (HBV-C)
Description:
Residue:
183
  
Inhibitor
Name:
BDBM473069
Synonyms:
US10836769, Example 55
Type:
Small organic molecule
Emp. Form.:
C23H18ClF5N6O3
Mol. Mass.:
556.872
SMILES:
FC(F)c1cc(NC(=O)c2c(Cl)c(C(=O)C(=O)NC3(CC(F)(F)C3)c3c[nH]nn3)n3CCCc23)ccc1F
: