Target
Mitogen-activated protein kinase 1
Ligand
BDBM365052
Substrate
Meas. Tech.
Enzymatic Assay
IC50
0.036±n/a nM
Citation
 Kolesnikov, ADo, S Serine/threonine kinase inhibitors US Patent  US10842799 Publication Date 11/24/2020 
Target
Name:
Mitogen-activated protein kinase 1
Synonyms:
ERK2 Extracellular signal-regulated kinase 2 Extracellular signal-regulated kinase 2 (ERK2) MAPK 2 MK01_HUMAN Mitogen-activated protein kinase 1 (ERK-2) Mitogen-activated protein kinase 2 PRKM2 | p42-MAPK
Type:
Ser/Thr Protein Kinase
Mol. Mass.:
41392.76
Organism:
Homo sapiens (Human)
Description:
P28482
Residue:
360
  
Inhibitor
Name:
BDBM365052
Synonyms:
4-(3-(4-methoxybenzyl)-5- methyl-4,5-dihydro-3H- 1,2,2a1,5- tetraazaacenaphthylen-7-yl)- N-(1-methyl-1H-pyrazol-5- yl)pyridin-2-amine US10842799, I-18 US9867833, Compound I-18(S)
Type:
Small organic molecule
Emp. Form.:
C26H26N8O
Mol. Mass.:
466.5376
SMILES:
COc1ccc(CC2CN(C)c3cc(cc4nnc2n34)-c2ccnc(Nc3ccnn3C)c2)cc1
: