Target
WD repeat-containing protein 5
Ligand
BDBM473407
Substrate
Meas. Tech.
TR-FRET Binding Assay
Ki
<0.100±n/a nM
Citation
 Alvarado, JRStauffer, SRGogliotti, RDHan, CMeyers, KMTian, JMacdonald, JDFesik, SWLee, T WDR5 inhibitors and modulators US Patent  US10844044 Publication Date 11/24/2020 
Target
Name:
WD repeat-containing protein 5
Synonyms:
BIG3 WD repeat-containing protein 5 (WDR5) WDR5 | WDR5_HUMAN
Type:
Protein
Mol. Mass.:
36597.13
Organism:
Homo sapiens (Human)
Description:
P61964
Residue:
334
  
Inhibitor
Name:
BDBM473407
Synonyms:
US10844044, Example 54
Type:
Small organic molecule
Emp. Form.:
C30H30F2N4O
Mol. Mass.:
500.5822
SMILES:
Cc1cc(ccc1F)[C@@H](NC(=O)c1cc(Cn2ccn(C)c2=N)cc(c1)-c1ccc(F)cc1C)C1CC1
: