Target
Non-receptor tyrosine-protein kinase TYK2
Ligand
BDBM473570
Substrate
Meas. Tech.
Biochemical Kinase Assay
IC50
2.51±n/a nM
Citation
 Colson, PFass, GT Process for preparing JAK inhibitors and intermediates thereof US Patent  US10844057 Publication Date 11/24/2020 
Target
Name:
Non-receptor tyrosine-protein kinase TYK2
Synonyms:
Non-receptor tyrosine-protein kinase TYK2 (TYK2) TYK2_HUMAN | Tyrosine-protein kinase TYK2
Type:
Protein
Mol. Mass.:
133666.03
Organism:
Homo sapiens (Human)
Description:
P29597
Residue:
1187
  
Inhibitor
Name:
BDBM473570
Synonyms:
US10844057, Example 13 US11634419, Example 6
Type:
Small organic molecule
Emp. Form.:
C31H39N7O2
Mol. Mass.:
541.6871
SMILES:
CCCN1Cc2[nH]c(nc2C[C@H]1C(=O)N1CC(C)(C1)N(C)C)-c1n[nH]c2cc(ccc12)-c1ccc(O)cc1CC
: