Target
Proto-oncogene tyrosine-protein kinase receptor Ret
Ligand
BDBM473739
Substrate
Meas. Tech.
Time-Resolved Fluorescence Transfer (FRET) Assay
IC50
11.9±n/a nM
Citation
 Jordan, AMNewton, RWaszkowycz, BSutton, JMHynd, GPaoletta, SFordyce, EA Heterocyclic compounds as RET kinase inhibitors US Patent  US10844067 Publication Date 11/24/2020 
Target
Name:
Proto-oncogene tyrosine-protein kinase receptor Ret
Synonyms:
CDHF12 Cadherin family member 12 Proto-oncogene c-Ret RET51 Tyrosine-protein kinase Ret (RET)
Type:
Protein
Mol. Mass.:
124318.29
Organism:
Homo sapiens (Human)
Description:
P07949
Residue:
1114
  
Inhibitor
Name:
BDBM473739
Synonyms:
3-(3-Chloro-1H-pyrrolo[2,3-b]pyridin-2-yl)- 1-propyl-1H-pyrazolo[3,4-d]pyrimidin-4- amine US11661423, Example 82
Type:
Small organic molecule
Emp. Form.:
C15H14ClN7
Mol. Mass.:
327.772
SMILES:
CCCn1nc(-c2[nH]c3ncccc3c2Cl)c2c(N)ncnc12
: