Target
Cytochrome P450 11B2, mitochondrial
Ligand
BDBM473929
Substrate
Meas. Tech.
Inhibition of Aldosterone Synthase
IC50
24.0±n/a nM
Citation
 Balestra, MBurke, JChen, ZCogan, DLord, JMarshall, DRMcKibben, BPMeyers, KMZhang, Y Bicyclic imidazole derivatives useful for the treatment of renal diseases, cardiovascular diseases and fibrotic diseases US Patent  US10858342 Publication Date 12/8/2020 
Target
Name:
Cytochrome P450 11B2, mitochondrial
Synonyms:
Aldosterone Synthase (CYP11B2) Aldosterone-synthesizing enzyme CYP11B2 Cytochrome P450 11B2 Cytochrome P450 11B2, mitochondrial P-450C18 | Steroid 18-hydroxylase
Type:
Protein
Mol. Mass.:
57582.15
Organism:
Homo sapiens (Human)
Description:
P19099
Residue:
503
  
Inhibitor
Name:
BDBM473929
Synonyms:
3-Cyclohexylmethyl-6,6- dimethyl-3,5,6,7-tetrahydro- benzoimidazol-4-one | US10858342, Compound C-ACP
Type:
Small organic molecule
Emp. Form.:
C16H24N2O
Mol. Mass.:
260.3746
SMILES:
CC1(C)Cc2ncn(CC3CCCCC3)c2C(=O)C1
: