Target
Adenosine receptor A2b
Ligand
BDBM474230
Substrate
Meas. Tech.
Binding Affinities to Different Adenosine Receptors
IC50
0.400±n/a nM
Citation
 Zeng, QQi, CTsui, HYang, ZZhang, X Triazolo-pyrimidine compounds and uses thereof US Patent  US10858365 Publication Date 12/8/2020 
Target
Name:
Adenosine receptor A2b
Synonyms:
AA2BR_HUMAN ADORA2B Adenosine receptors A2b | Adenosine receptors; A2a & A2b
Type:
G Protein-Coupled Receptor (GPCR)
Mol. Mass.:
36341.22
Organism:
Homo sapiens (Human)
Description:
Residue:
332
  
Inhibitor
Name:
BDBM474230
Synonyms:
5-(5-amino-7-(4-fluorophenyl)-2-((3-fluoropyrid in-2-yl)methyl)-[l,2,4]triazolo[1,5-c]pyrimidin-8- yl)-1-ethylpyridin-2(1H)-one US11629147, Cmpd. 34
Type:
Small organic molecule
Emp. Form.:
C24H19F2N7O
Mol. Mass.:
459.4508
SMILES:
CCn1cc(ccc1=O)-c1c(nc(N)n2nc(Cc3ncccc3F)nc12)-c1ccc(F)cc1
: