Target
Adenosine receptor A2a
Ligand
BDBM474281
Substrate
Meas. Tech.
FLIPR and cAMP Inhibition Assay
IC50
0.600±n/a nM
Citation
 Zeng, QQi, CTsui, HYang, ZZhang, X Triazolo-pyrimidine compounds and uses thereof US Patent  US10858365 Publication Date 12/8/2020 
Target
Name:
Adenosine receptor A2a
Synonyms:
AA2AR_MOUSE Adenosine receptor A2a | Adora2a
Type:
PROTEIN
Mol. Mass.:
44984.04
Organism:
Mus musculus
Description:
ChEMBL_479903
Residue:
410
  
Inhibitor
Name:
BDBM474281
Synonyms:
7-(4-fluorophenyl)-2-((3-fluoropyridin-2-yl) methyl)-8-(1-methyl-1H-benzo[d]imidazol-6-yl)- [1,2,4]triazolo[l,5-c]pyrimidin-5-amine | US10858365, Compound 65
Type:
Small organic molecule
Emp. Form.:
C25H19F3N6O2
Mol. Mass.:
492.4526
SMILES:
Nc1nc(-c2ccc(F)cc2)c(-c2ccc(=O)n(CCO)c2)c2nc(Cc3c(F)cccc3F)nn12
: