Target
Polymerase acidic protein
Ligand
BDBM474347
Substrate
Meas. Tech.
Endonuclease Inhibition Assay (PA FP Assay)
IC50
40.0±n/a nM
Citation
 Jain, RKoester, DCManning, JRSutton, JCTaft, BRWan, LZhao, Q Tricyclic compounds useful to treat orthomyxovirus infections US Patent  US10858366 Publication Date 12/8/2020 
Target
Name:
Polymerase acidic protein
Synonyms:
PA RNA-directed RNA polymerase subunit P2
Type:
Protein
Mol. Mass.:
82806.72
Organism:
Description:
P31343
Residue:
716
 
Inhibitor
Name:
BDBM474347
Synonyms:
(S)-6-benzhydryl-3-cyclopropyl-11-hydroxy- 5H-imidazo[1,2-a]pyrido[2,1-c]pyrazin- 10(6H)-one US11453677, Example 8
Type:
Small organic molecule
Emp. Form.:
C26H23N3O2
Mol. Mass.:
409.4797
SMILES:
Oc1c2-c3ncc(C4CC4)n3C[C@H](C(c3ccccc3)c3ccccc3)n2ccc1=O
: