Target
Polymerase acidic protein
Ligand
BDBM474358
Substrate
Meas. Tech.
Endonuclease Inhibition Assay (PA FP Assay)
IC50
20.0±n/a nM
Citation
 Jain, RKoester, DCManning, JRSutton, JCTaft, BRWan, LZhao, Q Tricyclic compounds useful to treat orthomyxovirus infections US Patent  US10858366 Publication Date 12/8/2020 
Target
Name:
Polymerase acidic protein
Synonyms:
PA RNA-directed RNA polymerase subunit P2
Type:
Protein
Mol. Mass.:
82806.72
Organism:
Description:
P31343
Residue:
716
 
Inhibitor
Name:
BDBM474358
Synonyms:
(S)-6-((S)-(4-fluorophenyl)(o-tolyl)methyl)-11- hydroxy-5,6-dihydro-10H- imidazo[2',1':3,4]pyrazino[1,2-b]pyridazin-10- one US11453677, Example 40
Type:
Small organic molecule
Emp. Form.:
C23H19FN4O2
Mol. Mass.:
402.421
SMILES:
Cc1ccccc1[C@@H]([C@H]1Cn2ccnc2-c2c(O)c(=O)cnn12)c1ccc(F)cc1
: