Target
Polymerase acidic protein
Ligand
BDBM474361
Substrate
Meas. Tech.
Endonuclease Inhibition Assay (PA FP Assay)
IC50
8.00±n/a nM
Citation
 Jain, RKoester, DCManning, JRSutton, JCTaft, BRWan, LZhao, Q Tricyclic compounds useful to treat orthomyxovirus infections US Patent  US10858366 Publication Date 12/8/2020 
Target
Name:
Polymerase acidic protein
Synonyms:
PA RNA-directed RNA polymerase subunit P2
Type:
Protein
Mol. Mass.:
82806.72
Organism:
Description:
P31343
Residue:
716
 
Inhibitor
Name:
BDBM474361
Synonyms:
(S)-6-benzhydryl-11-hydroxy-3-(1H-pyrazol- 4-yl)-5,6-dihydro-10H-imidazo[1,2- a]pyrido[2,1-c]pyrazin-10-one US11453677, Example 52
Type:
Small organic molecule
Emp. Form.:
C26H21N5O2
Mol. Mass.:
435.4772
SMILES:
Oc1c2-c3ncc(-c4cn[nH]c4)n3C[C@H](C(c3ccccc3)c3ccccc3)n2ccc1=O
: