Target
Neuraminidase
Ligand
BDBM474380
Substrate
EC50
1400±n/a nM
Citation
 Jain, RKoester, DCManning, JRSutton, JCTaft, BRWan, LZhao, Q Tricyclic compounds useful to treat orthomyxovirus infections US Patent  US10858366 Publication Date 12/8/2020 
Target
Name:
Neuraminidase
Synonyms:
Type:
Protein
Mol. Mass.:
51409.73
Organism:
Description:
Q1P9S2
Residue:
466
 
Inhibitor
Name:
BDBM474380
Synonyms:
5-benzhydryl-10-hydroxy-3-methyl-4,5- dihydroimidazo[4,5-d]pyrido[1,2-b]pyridazin- 9(3H)-one | US10858366, Example 82
Type:
Small organic molecule
Emp. Form.:
C23H20N4O2
Mol. Mass.:
384.4305
SMILES:
Cn1cnc-2c1CN(C(c1ccccc1)c1ccccc1)n1ccc(=O)c(O)c-21
: